Target
Tyrosine-protein phosphatase non-receptor type 11
Ligand
BDBM88760
Substrate
Meas. Tech.
Dose Response selectivity of inhibitors of Striatal-Enriched Phosphatase (STEP) in a SHP2 (PTPN11) Inhibition Assay
IC50
3250±n/a nM
Citation
 PubChem, PC Dose Response selectivity of inhibitors of Striatal-Enriched Phosphatase (STEP) in a SHP2 (PTPN11) Inhibition Assay PubChem Bioassay (2012)[AID] 
Target
Name:
Tyrosine-protein phosphatase non-receptor type 11
Synonyms:
3.1.3.48 PTP-1D PTP2C Protein Tyrosine Phosphatase PPN11/Shp2 Protein-Tyrosine Phosphatase SHP-2 Protein-tyrosine phosphatase 2C SH-PTP3 SHP2 Src homology phosphatase 2 (SHP-2) Tyrosine-protein phosphatase non-receptor type 11 (SHP-2) | Tyrosine-protein phosphatase non-receptor type 11 (SHP2)
Type:
Protein phosphatase
Mol. Mass.:
68443.59
Organism:
Homo sapiens (Human)
Description:
Q06124
Residue:
593
  
Inhibitor
Name:
BDBM88760
Synonyms:
(4-benzylpiperazin-1-yl)-[4-(dimethylamino)phenyl]methanethione 4-[(4-benzyl-1-piperazinyl)carbonothioyl]-N,N-dimethylaniline SMR000296756 [4-(dimethylamino)phenyl]-[4-(phenylmethyl)piperazin-1-yl]methanethione | cid_2237734
Type:
Small organic molecule
Emp. Form.:
C20H25N3S
Mol. Mass.:
339.498
SMILES:
CN(C)c1ccc(cc1)C(=S)N1CCN(Cc2ccccc2)CC1
: