Target
26S proteasome non-ATPase regulatory subunit 14
Ligand
BDBM88904
Substrate
Meas. Tech.
Dose response confirmation of uHTS RPN11 inhibitor hits in a Fluorescence Polarization assay
IC50
8150±913 nM
Citation
 PubChem, PC Dose response confirmation of uHTS RPN11 inhibitor hits in a Fluorescence Polarization assay PubChem Bioassay (2012)[AID] 
Target
Name:
26S proteasome non-ATPase regulatory subunit 14
Synonyms:
26S Proteasome regulatory subunit Rpn11 (Rpn11) PSDE_HUMAN PSMD14 protein
Type:
Protein
Mol. Mass.:
34576.68
Organism:
Homo sapiens (Human)
Description:
O00487
Residue:
310
  
Inhibitor
Name:
BDBM88904
Synonyms:
(5Z)-1,3-dimethyl-5-[(2Z)-2-(1-methyl-2-pyrrolidinylidene)ethylidene]-2-sulfanylidene-4-imidazolidinone (5Z)-1,3-dimethyl-5-[(2Z)-2-(1-methylpyrrolidin-2-ylidene)ethylidene]-2-sulfanylideneimidazolidin-4-one MLS000693130 cid_6338637
Type:
Small organic molecule
Emp. Form.:
C12H17N3OS
Mol. Mass.:
251.348
SMILES:
CN1CCC\C1=C\C=C1/N(C)C(=S)N(C)C1=O
: