Target
26S proteasome non-ATPase regulatory subunit 14
Ligand
BDBM88955
Substrate
Meas. Tech.
Dose response confirmation of uHTS RPN11 inhibitor hits in a Fluorescence Polarization assay
IC50
2940±739 nM
Citation
 PubChem, PC Dose response confirmation of uHTS RPN11 inhibitor hits in a Fluorescence Polarization assay PubChem Bioassay (2012)[AID] 
Target
Name:
26S proteasome non-ATPase regulatory subunit 14
Synonyms:
26S Proteasome regulatory subunit Rpn11 (Rpn11) PSDE_HUMAN PSMD14 protein
Type:
Protein
Mol. Mass.:
34576.68
Organism:
Homo sapiens (Human)
Description:
O00487
Residue:
310
  
Inhibitor
Name:
BDBM88955
Synonyms:
Averufin SMR000470849 | cid_638296
Type:
Small organic molecule
Emp. Form.:
C20H16O7
Mol. Mass.:
368.3368
SMILES:
[H][C@]12CCC[C@](C)(Oc3cc4C(=O)c5cc(O)cc(O)c5C(=O)c4c(O)c13)O2
: