Target
Prothrombin
Ligand
BDBM88904
Substrate
Meas. Tech.
Dose Response validation of uHTS RPN11 inhibitor hits using a Thrombin Fluorescence Polarization assay
IC50
29000±2460 nM
Citation
 PubChem, PC Dose Response validation of uHTS RPN11 inhibitor hits using a Thrombin Fluorescence Polarization assay PubChem Bioassay (2012)[AID] 
Target
Name:
Prothrombin
Synonyms:
Activation peptide fragment 1 Coagulation factor II Prothrombin Thrombin Thrombin light chain
Type:
Enzyme
Mol. Mass.:
70502.73
Organism:
Bos taurus (Bovine)
Description:
P00735
Residue:
625
  
Inhibitor
Name:
BDBM88904
Synonyms:
(5Z)-1,3-dimethyl-5-[(2Z)-2-(1-methyl-2-pyrrolidinylidene)ethylidene]-2-sulfanylidene-4-imidazolidinone (5Z)-1,3-dimethyl-5-[(2Z)-2-(1-methylpyrrolidin-2-ylidene)ethylidene]-2-sulfanylideneimidazolidin-4-one MLS000693130 cid_6338637
Type:
Small organic molecule
Emp. Form.:
C12H17N3OS
Mol. Mass.:
251.348
SMILES:
CN1CCC\C1=C\C=C1/N(C)C(=S)N(C)C1=O
: