Target
Zinc finger protein GLI1
Ligand
BDBM43528
Substrate
Meas. Tech.
Dose response confirmation of uHTS antagonist hits from Gli-SUFU in a luminescent reporter assay
IC50
3010±n/a nM
Citation
 PubChem, PC Dose response confirmation of uHTS antagonist hits from Gli-SUFU in a luminescent reporter assay PubChem Bioassay (2012)[AID] 
Target
Name:
Zinc finger protein GLI1
Synonyms:
GLI1_MOUSE Gli1 | Glioma-associated oncogene homolog
Type:
PROTEIN
Mol. Mass.:
118579.34
Organism:
Mus musculus
Description:
EBI_101259
Residue:
1111
  
Inhibitor
Name:
BDBM43528
Synonyms:
(4-chlorophenyl)-[4-(7-chloro-4-quinolinyl)-1-piperazinyl]methanone (4-chlorophenyl)-[4-(7-chloroquinolin-4-yl)piperazin-1-yl]methanone MLS000676065 [4-(7-chloranylquinolin-4-yl)piperazin-1-yl]-(4-chlorophenyl)methanone | cid_1251584
Type:
Small organic molecule
Emp. Form.:
C20H17Cl2N3O
Mol. Mass.:
386.274
SMILES:
Clc1ccc(cc1)C(=O)N1CCN(CC1)c1ccnc2cc(Cl)ccc12
: