Target
Zinc finger protein GLI1
Ligand
BDBM89448
Substrate
Meas. Tech.
Dose response confirmation of uHTS antagonist hits from Gli-SUFU in a luminescent reporter assay
IC50
5140±n/a nM
Citation
 PubChem, PC Dose response confirmation of uHTS antagonist hits from Gli-SUFU in a luminescent reporter assay PubChem Bioassay (2012)[AID] 
Target
Name:
Zinc finger protein GLI1
Synonyms:
GLI1_MOUSE Gli1 | Glioma-associated oncogene homolog
Type:
PROTEIN
Mol. Mass.:
118579.34
Organism:
Mus musculus
Description:
EBI_101259
Residue:
1111
  
Inhibitor
Name:
BDBM89448
Synonyms:
3-amino-N-(4-methoxyphenyl)-4-(1-piperidinyl)benzenesulfonamide 3-amino-N-(4-methoxyphenyl)-4-piperidino-benzenesulfonamide MLS002164032 cid_3746718
Type:
Small organic molecule
Emp. Form.:
C18H23N3O3S
Mol. Mass.:
361.459
SMILES:
COc1ccc(NS(=O)(=O)c2ccc(N3CCCCC3)c(N)c2)cc1
: