Target
Beta-2 adrenergic receptor
Ligand
BDBM84210
Substrate
Meas. Tech.
Dose response for HTS for Beta-2AR agonists via FAP method from Powderset3
EC50
1510±n/a nM
Citation
 PubChem, PC Dose response for HTS for Beta-2AR agonists via FAP method from Powderset3 PubChem Bioassay (2012)[AID] 
Target
Name:
Beta-2 adrenergic receptor
Synonyms:
ADRB2 ADRB2_HUMAN Beta-2 adrenoceptor | Beta-2 adrenoreceptor
Type:
Mol. Mass.:
46461.69
Organism:
Homo sapiens (Human)
Description:
P07550
Residue:
413
  
Inhibitor
Name:
BDBM84210
Synonyms:
MLS000119700 N-[2-(2,5-dimethoxyphenyl)ethyl]-1-(5-pyrrol-1-yl-1,3,4-thiadiazol-2-yl)piperidine-4-carboxamide SMR000096621 | cid_5307895
Type:
Small organic molecule
Emp. Form.:
C22H27N5O3S
Mol. Mass.:
441.546
SMILES:
COc1ccc(OC)c(CCNC(=O)C2CCN(CC2)c2nnc(s2)-n2cccc2)c1
: