Target
Multidrug efflux pump
Ligand
BDBM84135
Substrate
Meas. Tech.
Dose Response HTS singleplex for inhibitors of yeast efflux pump, specifically Mdr1 with Cherry Pick2 compound set
EC50
16880±n/a nM
Citation
 PubChem, PC Dose Response HTS singleplex for inhibitors of yeast efflux pump, specifically Mdr1 with Cherry Pick2 compound set PubChem Bioassay (2012)[AID] 
Target
Name:
Multidrug efflux pump
Synonyms:
Candida albicans strain ATCC 10261 multidrug efflux pump (MDR1) gene, MDR1-A allele, complete cds
Type:
Enzyme Catalytic Domain
Mol. Mass.:
62915.82
Organism:
Candida albicans
Description:
Q09GR2
Residue:
564
  
Inhibitor
Name:
BDBM84135
Synonyms:
MLS000877353 cid_16682116
Type:
Small organic molecule
Emp. Form.:
C27H23ClFN3O5
Mol. Mass.:
523.94
SMILES:
Cc1noc(C)c1C(=O)N1CCC2(CC1)Oc1ccc(F)cc1C(=O)C21CC(=NO1)c1ccc(Cl)cc1
: