Target
DNA dC->dU-editing enzyme APOBEC-3G
Ligand
BDBM55750
Substrate
Meas. Tech.
SAR analysis of small molecule inhibitors of APOBEC3G DNA Deaminase via a fluorescence-based single-stranded DNA deaminase assay - Set 2
Temperature
298.15±n/a K
IC50
695±n/a nM
Comments
extracted
Citation
 PubChem, PC SAR analysis of small molecule inhibitors of APOBEC3G DNA Deaminase via a fluorescence-based single-stranded DNA deaminase assay - Set 2 PubChem Bioassay (2012)[AID] 
Target
Name:
DNA dC->dU-editing enzyme APOBEC-3G
Synonyms:
ABC3G_HUMAN | APOBEC3G
Type:
Enzyme Catalytic Domain
Mol. Mass.:
46419.54
Organism:
Homo sapiens (Human)
Description:
gi_13399304
Residue:
384
  
Inhibitor
Name:
BDBM55750
Synonyms:
5-(2-phenylethylamino)-3H-1,3,4-thiadiazole-2-thione CHEMBL290545 SMR000289534 | cid_2916953
Type:
Small organic molecule
Emp. Form.:
C10H11N3S2
Mol. Mass.:
237.344
SMILES:
Sc1nnc(NCCc2ccccc2)s1
: