Target
Cyclin-dependent kinase 2
Ligand
BDBM91792
Substrate
Meas. Tech.
ITC
pH
7.5±n/a
Temperature
298.15±n/a K
Kd
6030±n/a nM
Citation
 CSARdock, CD CDK2 in CSAR_FULL_RELEASE_3JULY2012 CSAR 1:0 (2012)  
Target
Name:
Cyclin-dependent kinase 2
Synonyms:
CDK2 CDK2_HUMAN Cell division protein kinase 2 Protein cereblon/Cyclin-dependent kinase 2 | p33 protein kinase
Type:
Enzyme Subunit
Mol. Mass.:
33938.17
Organism:
Homo sapiens (Human)
Description:
P24941
Residue:
298
  
Inhibitor
Name:
BDBM91792
Synonyms:
CS4
Type:
Emp. Form.:
C14H12N3O3
Mol. Mass.:
270.2639
SMILES:
[O-]C(=O)c1ccc(cc1)C(=O)Nc1cc(n[nH]1)C1CC1
: