Target
Cyclin-A2/Cyclin-dependent kinase 2
Ligand
BDBM91819
Substrate
Meas. Tech.
OctetRed
pH
7.5±n/a
Temperature
298.15±n/a K
Kd
>100000±n/a nM
Citation
 CSARdock, CD CDK2-CyclinA in CSAR_FULL_RELEASE_3JULY2012 CSAR 1:0 (2012)  
Target
Name:
Cyclin-A2/Cyclin-dependent kinase 2
Synonyms:
CDK2-CyclinA CDK2/Cyclin A Cyclin A2/dependent kinase 2 Cyclin-Dependent Kinase 2 (CDK2A)
Type:
Protein Complex
Mol. Mass.:
Description:
Cdk2/Cyclin A kinase was purified from insect cells coinfected with Cyclin A/Cdk2 baculovirus.
Components:
This complex has 2 components.
Component 1
Name:
Cyclin-dependent kinase 2
Synonyms:
CDK2 CDK2_HUMAN Cell division protein kinase 2 Protein cereblon/Cyclin-dependent kinase 2 | p33 protein kinase
Type:
Enzyme Subunit
Mol. Mass.:
33938.17
Organism:
Homo sapiens (Human)
Description:
P24941
Residue:
298
  
Component 2
Name:
Cyclin-A2
Synonyms:
CCN1 CCNA1 CCNA2_HUMAN Cyclin-A
Type:
Enzyme Subunit
Mol. Mass.:
48550.19
Organism:
Homo sapiens (Human)
Description:
P20248
Residue:
432
  
Inhibitor
Name:
BDBM91819
Synonyms:
CS92
Type:
Emp. Form.:
C17H23N5O3
Mol. Mass.:
345.3962
SMILES:
COC(=O)c1ccccc1Oc1nc(NC(C)C)nc(NC(C)C)n1
: