Target
Serine/threonine-protein kinase Chk1
Ligand
BDBM91915
Substrate
Meas. Tech.
Abbott Kinase Enzymatics_CHK1/289 CDC25c
IC50
7±n/a nM
Citation
 CSARdock, CD CHK1 in CSAR_FULL_RELEASE_3JULY2012 CSAR 1:0 (2012)  
Target
Name:
Serine/threonine-protein kinase Chk1
Synonyms:
CHEK1 CHK1 checkpoint homolog Checkpoint kinase-1 (CHK1)
Type:
Enzyme Catalytic Domain
Mol. Mass.:
54443.02
Organism:
Homo sapiens (Human)
Description:
gi_166295192
Residue:
476
  
Inhibitor
Name:
BDBM91915
Synonyms:
Chk1_49
Type:
Emp. Form.:
C17H16ClN5O3
Mol. Mass.:
373.794
SMILES:
OC1CCC(C1)Oc1ccc(Cl)cc1NC(=O)Nc1cnc(cn1)C#N
: