Target
Cytochrome P450 2E1
Ligand
BDBM92498
Substrate
Meas. Tech.
Binding Assay
Kd
9.0e+3±n/a nM
Citation
 Porubsky, PRBattaile, KPScott, EE Human cytochrome P450 2E1 structures with fatty acid analogs reveal a previously unobserved binding mode. J Biol Chem 285:22282-90 (2010)  
Target
Name:
Cytochrome P450 2E1
Synonyms:
CP2E1_HUMAN CYP2E1 | Cytochrome P450 2E1 (CYP2E1)
Type:
Enzyme
Mol. Mass.:
56860.34
Organism:
Homo sapiens (Human)
Description:
P05181
Residue:
493
  
Inhibitor
Name:
BDBM92498
Synonyms:
Omega-imidazolyl decanoic acid
Type:
Fatty acid
Emp. Form.:
C13H22N2O2
Mol. Mass.:
238.326
SMILES:
OC(=O)CCCCCCCCCn1ccnc1
: