Target
2'-deoxynucleoside 5'-phosphate N-hydrolase 1
Ligand
BDBM92538
Substrate
Meas. Tech.
Inhibition Assay
Ki
4.0e+4±n/a nM
Citation
 Dupouy, CZhang, CPadilla, APochet, SKaminski, PA Probing the active site of the deoxynucleotide N-hydrolase Rcl encoded by the rat gene c6orf108. J Biol Chem 285:41806-14 (2010)  
Target
Name:
2'-deoxynucleoside 5'-phosphate N-hydrolase 1
Synonyms:
DNPH1_RAT Deoxyribonucleoside 5'-monophosphate N-glycosidase (Rcl) D69N Deoxyribonucleoside 5'-monophosphate N-glycosidase (Rcl) S117A Dnph1 c-Myc-responsive protein Rcl
Type:
Enzyme
Mol. Mass.:
17775.23
Organism:
Rattus norvegicus (Rat)
Description:
O35820
Residue:
163
  
Inhibitor
Name:
BDBM92538
Synonyms:
AMP adenosine 5'-phosphate group
Type:
Small molecule
Emp. Form.:
C10H12N5O7P
Mol. Mass.:
345.2064
SMILES:
Nc1ncnc2n(cnc12)C1OC(COP([O-])([O-])=O)C(O)C1O
: