Target
Cytochrome P450 130
Ligand
BDBM10999
Substrate
Meas. Tech.
Binding Assay
Kd
9.990e+6± 2.83e+5 nM
Citation
 Podust, LMOuellet, Hvon Kries, JPde Montellano, PR Interaction of Mycobacterium tuberculosis CYP130 with heterocyclic arylamines. J Biol Chem 284:25211-9 (2009)  
Target
Name:
Cytochrome P450 130
Synonyms:
CP130_MYCTO cyp130
Type:
Enzyme
Mol. Mass.:
44574.98
Organism:
Mycobacterium tuberculosis
Description:
P9WPN4
Residue:
405
  
Inhibitor
Name:
BDBM10999
Synonyms:
Benzenemethanamine CHEMBL522 phenylmethanamine
Type:
Small organic molecule
Emp. Form.:
C7H9N
Mol. Mass.:
107.1531
SMILES:
NCc1ccccc1
: