Target
Steroid C26-monooxygenase
Ligand
BDBM92572
Substrate
Meas. Tech.
Binding Assay
Kd
5.92e+4± 1.7e+3 nM
Citation
 Podust, LMOuellet, Hvon Kries, JPde Montellano, PR Interaction of Mycobacterium tuberculosis CYP130 with heterocyclic arylamines. J Biol Chem 284:25211-9 (2009)  
Target
Name:
Steroid C26-monooxygenase
Synonyms:
CP142_MYCTO Cytochrome P450 142 (CYP142) | cyp142
Type:
Enzyme
Mol. Mass.:
41422.72
Organism:
Mycobacterium tuberculosis
Description:
P9WPL4
Residue:
372
  
Inhibitor
Name:
BDBM92572
Synonyms:
Aniline | Ph-NH2
Type:
Small organic molecule
Emp. Form.:
C6H7N
Mol. Mass.:
93.1265
SMILES:
Nc1ccccc1
: