Target
Receptor-interacting serine/threonine-protein kinase 2
Ligand
BDBM93524
Substrate
IC50
11830±n/a nM
Citation
 PubChem, PC Fluorescence-based cell-based high throughput dose response assay for inhibitors of the interaction of nucleotide-binding oligomerization domain containing 2 (NOD2) and the receptor-interacting serine-threonine kinase 2 (RIPK2) PubChem Bioassay (2012)[AID] 
Target
Name:
Receptor-interacting serine/threonine-protein kinase 2
Synonyms:
CARDIAK RIP2 RIPK2_HUMAN Tyrosine-protein kinase RIPK2 | receptor-interacting serine/threonine-protein kinase 2
Type:
Protein
Mol. Mass.:
61201.30
Organism:
Homo sapiens (Human)
Description:
Residue:
540
  
Inhibitor
Name:
BDBM93524
Synonyms:
MLS003124149 N-[2-(dimethylamino)ethyl]-3-[6-(4-ethylsulfanylphenyl)-8-formamidoimidazo[1,2-a]pyridin-3-yl]benzamide N-[2-(dimethylamino)ethyl]-3-[6-[4-(ethylthio)phenyl]-8-formamido-imidazo[1,2-a]pyridin-3-yl]benzamide cid_46944084
Type:
Small organic molecule
Emp. Form.:
C27H29N5O2S
Mol. Mass.:
487.616
SMILES:
CCSc1ccc(cc1)-c1cc(NC=O)c2ncc(-c3cccc(c3)C(=O)NCCN(C)C)n2c1
: