Target
Heat shock protein hsp-16.2
Ligand
BDBM93786
Substrate
IC50
>64000±n/a nM
Citation
 PubChem, PC Dose Response Confirmation of SKN-1 Inhibitor hits via a heat-shock counterscreen assay PubChem Bioassay (2012)[AID] 
Target
Name:
Heat shock protein hsp-16.2
Synonyms:
HSP12_CAEEL hsp-16 hsp16-2
Type:
Enzyme Catalytic Domain
Mol. Mass.:
16239.18
Organism:
Caenorhabditis elegans
Description:
gi_373219859
Residue:
145
  
Inhibitor
Name:
BDBM93786
Synonyms:
2-Amino-3-benzothiazol-2-yl-7-hydroxy-8-(2-methyl-piperidin-1-ylmethyl)-chromen-4-one 2-amino-3-(1,3-benzothiazol-2-yl)-7-hydroxy-8-[(2-methylpiperidin-1-yl)methyl]chromen-4-one 2-azanyl-3-(1,3-benzothiazol-2-yl)-8-[(2-methylpiperidin-1-yl)methyl]-7-oxidanyl-chromen-4-one SMR000218869 | cid_6184171
Type:
Small organic molecule
Emp. Form.:
C23H23N3O3S
Mol. Mass.:
421.512
SMILES:
CC1CCCCN1Cc1c(O)ccc2c1oc(N)c(-c1nc3ccccc3s1)c2=O
: