Target
Heat shock protein hsp-16.2
Ligand
BDBM93719
Substrate
IC50
>64000±n/a nM
Citation
 PubChem, PC Dose Response Confirmation of SKN-1 Inhibitor hits via a heat-shock counterscreen assay PubChem Bioassay (2012)[AID] 
Target
Name:
Heat shock protein hsp-16.2
Synonyms:
HSP12_CAEEL hsp-16 hsp16-2
Type:
Enzyme Catalytic Domain
Mol. Mass.:
16239.18
Organism:
Caenorhabditis elegans
Description:
gi_373219859
Residue:
145
  
Inhibitor
Name:
BDBM93719
Synonyms:
2-(4-methylsulfanylphenyl)chromen-4-one 2-[4-(methylthio)phenyl]-4H-chromen-4-one MLS000089864 cid_3245800
Type:
Small organic molecule
Emp. Form.:
C16H12O2S
Mol. Mass.:
268.33
SMILES:
CSc1ccc(cc1)-c1cc(=O)c2ccccc2o1
: