Target
Heat shock protein hsp-16.2
Ligand
BDBM93866
Substrate
IC50
44420±n/a nM
Citation
 PubChem, PC Dose Response Confirmation of SKN-1 Inhibitor hits via a heat-shock counterscreen assay PubChem Bioassay (2012)[AID] 
Target
Name:
Heat shock protein hsp-16.2
Synonyms:
HSP12_CAEEL hsp-16 hsp16-2
Type:
Enzyme Catalytic Domain
Mol. Mass.:
16239.18
Organism:
Caenorhabditis elegans
Description:
gi_373219859
Residue:
145
  
Inhibitor
Name:
BDBM93866
Synonyms:
2-chloranyl-4-[4-(4-chlorophenyl)piperazin-1-yl]pyrimidine 2-chloro-4-[4-(4-chlorophenyl)piperazin-1-yl]pyrimidine MLS001178632 cid_1713612
Type:
Small organic molecule
Emp. Form.:
C14H14Cl2N4
Mol. Mass.:
309.194
SMILES:
Clc1ccc(cc1)N1CCN(CC1)c1ccnc(Cl)n1
: