Target
Heat shock protein hsp-16.2
Ligand
BDBM76438
Substrate
IC50
15900±n/a nM
Citation
 PubChem, PC Dose Response Confirmation of SKN-1 Inhibitor hits via a heat-shock counterscreen assay PubChem Bioassay (2012)[AID] 
Target
Name:
Heat shock protein hsp-16.2
Synonyms:
HSP12_CAEEL hsp-16 hsp16-2
Type:
Enzyme Catalytic Domain
Mol. Mass.:
16239.18
Organism:
Caenorhabditis elegans
Description:
gi_373219859
Residue:
145
  
Inhibitor
Name:
BDBM76438
Synonyms:
2-(5-bromanylthiophen-2-yl)-6-chloranyl-imidazo[1,2-a]pyridine 2-(5-bromo-2-thienyl)-6-chloroimidazo[1,2-a]pyridine 2-(5-bromothiophen-2-yl)-6-chloroimidazo[1,2-a]pyridine SMR000180080 | cid_3850729
Type:
Small organic molecule
Emp. Form.:
C11H6BrClN2S
Mol. Mass.:
313.601
SMILES:
Clc1ccc2nc(cn2c1)-c1ccc(Br)s1
: