Target
Heat shock protein hsp-16.2
Ligand
BDBM93929
Substrate
IC50
55030±n/a nM
Citation
 PubChem, PC Dose Response Confirmation of SKN-1 Inhibitor hits via a heat-shock counterscreen assay PubChem Bioassay (2012)[AID] 
Target
Name:
Heat shock protein hsp-16.2
Synonyms:
HSP12_CAEEL hsp-16 hsp16-2
Type:
Enzyme Catalytic Domain
Mol. Mass.:
16239.18
Organism:
Caenorhabditis elegans
Description:
gi_373219859
Residue:
145
  
Inhibitor
Name:
BDBM93929
Synonyms:
4-(5-fluoranyl-1,3-benzothiazol-2-yl)-2-methyl-aniline MLS002702467 [4-(5-fluoro-1,3-benzothiazol-2-yl)-2-methyl-phenyl]amine | cid_396813
Type:
Small organic molecule
Emp. Form.:
C14H11FN2S
Mol. Mass.:
258.314
SMILES:
Cc1cc(ccc1N)-c1nc2cc(F)ccc2s1
: