Target
Heat shock protein hsp-16.2
Ligand
BDBM49288
Substrate
IC50
23110±n/a nM
Citation
 PubChem, PC Dose Response Confirmation of SKN-1 Inhibitor hits via a heat-shock counterscreen assay PubChem Bioassay (2012)[AID] 
Target
Name:
Heat shock protein hsp-16.2
Synonyms:
HSP12_CAEEL hsp-16 hsp16-2
Type:
Enzyme Catalytic Domain
Mol. Mass.:
16239.18
Organism:
Caenorhabditis elegans
Description:
gi_373219859
Residue:
145
  
Inhibitor
Name:
BDBM49288
Synonyms:
(5-chloro-2-pyridyl)-[4-(2-thienyl)thiazol-2-yl]amine MLS000064746 N-(5-chloro-2-pyridinyl)-4-thiophen-2-yl-2-thiazolamine SMR000077573 | cid_2214576
Type:
Small organic molecule
Emp. Form.:
C12H8ClN3S2
Mol. Mass.:
293.795
SMILES:
Clc1ccc(Nc2nc(cs2)-c2cccs2)nc1
: