Target
Heat shock protein hsp-16.2
Ligand
BDBM93731
Substrate
IC50
43490±n/a nM
Citation
 PubChem, PC Dose Response Confirmation of SKN-1 Inhibitor hits via a heat-shock counterscreen assay PubChem Bioassay (2012)[AID] 
Target
Name:
Heat shock protein hsp-16.2
Synonyms:
HSP12_CAEEL hsp-16 hsp16-2
Type:
Enzyme Catalytic Domain
Mol. Mass.:
16239.18
Organism:
Caenorhabditis elegans
Description:
gi_373219859
Residue:
145
  
Inhibitor
Name:
BDBM93731
Synonyms:
4-(5-phenyl-1,2,4-oxadiazol-3-yl)pyridine 5-phenyl-3-pyridin-4-yl-1,2,4-oxadiazole SMR000070364 | cid_763852
Type:
Small organic molecule
Emp. Form.:
C13H9N3O
Mol. Mass.:
223.2301
SMILES:
c1ccc(cc1)-c1nc(no1)-c1ccncc1
: