Target
Heat shock protein hsp-16.2
Ligand
BDBM93899
Substrate
IC50
46300±n/a nM
Citation
 PubChem, PC Dose Response Confirmation of SKN-1 Inhibitor hits via a heat-shock counterscreen assay PubChem Bioassay (2012)[AID] 
Target
Name:
Heat shock protein hsp-16.2
Synonyms:
HSP12_CAEEL hsp-16 hsp16-2
Type:
Enzyme Catalytic Domain
Mol. Mass.:
16239.18
Organism:
Caenorhabditis elegans
Description:
gi_373219859
Residue:
145
  
Inhibitor
Name:
BDBM93899
Synonyms:
MLS001172099 N-[3-(methylthio)phenyl]-8-quinolinecarboxamide SMR000595098 | cid_9119958
Type:
Small organic molecule
Emp. Form.:
C17H14N2OS
Mol. Mass.:
294.371
SMILES:
CSc1cccc(NC(=O)c2cccc3cccnc23)c1
: