Target
Heat shock protein hsp-16.2
Ligand
BDBM93820
Substrate
IC50
13600±n/a nM
Citation
 PubChem, PC Dose Response Confirmation of SKN-1 Inhibitor hits via a heat-shock counterscreen assay PubChem Bioassay (2012)[AID] 
Target
Name:
Heat shock protein hsp-16.2
Synonyms:
HSP12_CAEEL hsp-16 hsp16-2
Type:
Enzyme Catalytic Domain
Mol. Mass.:
16239.18
Organism:
Caenorhabditis elegans
Description:
gi_373219859
Residue:
145
  
Inhibitor
Name:
BDBM93820
Synonyms:
(5-methyl-2-pyridyl)-[4-(2-thienyl)thiazol-2-yl]amine MLS000664981 N-(5-methylpyridin-2-yl)-4-thiophen-2-yl-1,3-thiazol-2-amine cid_972421
Type:
Small organic molecule
Emp. Form.:
C13H11N3S2
Mol. Mass.:
273.377
SMILES:
Cc1ccc(Nc2nc(cs2)-c2cccs2)nc1
: