Target
Heat shock protein hsp-16.2
Ligand
BDBM93717
Substrate
IC50
2680±n/a nM
Citation
 PubChem, PC Dose Response Confirmation of SKN-1 Inhibitor hits via a heat-shock counterscreen assay PubChem Bioassay (2012)[AID] 
Target
Name:
Heat shock protein hsp-16.2
Synonyms:
HSP12_CAEEL hsp-16 hsp16-2
Type:
Enzyme Catalytic Domain
Mol. Mass.:
16239.18
Organism:
Caenorhabditis elegans
Description:
gi_373219859
Residue:
145
  
Inhibitor
Name:
BDBM93717
Synonyms:
2-(4-chlorophenyl)-5-(2-furanyl)-1,3,4-oxadiazole 2-(4-chlorophenyl)-5-(furan-2-yl)-1,3,4-oxadiazole SMR000024614 | cid_707391
Type:
Small organic molecule
Emp. Form.:
C12H7ClN2O2
Mol. Mass.:
246.649
SMILES:
Clc1ccc(cc1)-c1nnc(o1)-c1ccco1
: