Target
Heat shock protein hsp-16.2
Ligand
BDBM93819
Substrate
IC50
48970±n/a nM
Citation
 PubChem, PC Dose Response Confirmation of SKN-1 Inhibitor hits via a heat-shock counterscreen assay PubChem Bioassay (2012)[AID] 
Target
Name:
Heat shock protein hsp-16.2
Synonyms:
HSP12_CAEEL hsp-16 hsp16-2
Type:
Enzyme Catalytic Domain
Mol. Mass.:
16239.18
Organism:
Caenorhabditis elegans
Description:
gi_373219859
Residue:
145
  
Inhibitor
Name:
BDBM93819
Synonyms:
(E)-3-(2,4-difluoroanilino)-1-(2-furanyl)-2-propen-1-one (E)-3-(2,4-difluoroanilino)-1-(furan-2-yl)prop-2-en-1-one 3-[(2,4-difluorophenyl)amino]-1-(2-furyl)-2-propen-1-one SMR000293131 | cid_2196922
Type:
Small organic molecule
Emp. Form.:
C13H9F2NO2
Mol. Mass.:
249.2129
SMILES:
Fc1ccc(N=CCC(=O)c2ccco2)c(F)c1
: