Target
Neuropilin-1
Ligand
BDBM94232
Substrate
IC50
>95000±n/a nM
Citation
 PubChem, PC Dose Response confirmation of small molecule modulators of the interaction between CendR and NRP-1 in a panel assay PubChem Bioassay (2012)[AID] 
Target
Name:
Neuropilin-1
Synonyms:
Chain A, Crystal Structure Of The B1b2 Domains From Human Neuropilin- 1 NRP1 Neuropilin-1 | VEGF165R
Type:
PROTEIN
Mol. Mass.:
103122.09
Organism:
Homo sapiens (Human)
Description:
ChEMBL_617636
Residue:
923
  
Inhibitor
Name:
BDBM94232
Synonyms:
MLS000102134 N-[(1,2-dimethylindol-5-yl)methyl]-2-furamide SMR000016558 | cid_4360678
Type:
Small organic molecule
Emp. Form.:
C16H16N2O2
Mol. Mass.:
268.3104
SMILES:
Cc1cc2cc(CNC(=O)c3ccco3)ccc2n1C
: