Target
Perilipin-5
Ligand
BDBM82596
Substrate
IC50
4816±n/a nM
Citation
 PubChem, PC Luminescence-based biochemical high throughput dose response assay for inhibitors of the interaction of the lipase co-activator protein, abhydrolase domain containing 5 (ABHD5) with perilipin-5 (MLDP; PLIN5) PubChem Bioassay (2012)[AID] 
Target
Name:
Perilipin-5
Synonyms:
LSDP5 PAT-1 PLIN5_HUMAN
Type:
Enzyme Catalytic Domain
Mol. Mass.:
50774.20
Organism:
Homo sapiens (Human)
Description:
gi_116292172
Residue:
463
  
Inhibitor
Name:
BDBM82596
Synonyms:
2-[4-Butyl-5-(2-methyl-furan-3-yl)-4H-[1,2,4]triazol-3-ylsulfanyl]-N-furan-2-ylmethyl-acetamide 2-[[4-butyl-5-(2-methyl-3-furyl)-1,2,4-triazol-3-yl]thio]-N-(2-furfuryl)acetamide 2-[[4-butyl-5-(2-methylfuran-3-yl)-1,2,4-triazol-3-yl]sulfanyl]-N-(furan-2-ylmethyl)ethanamide SMR000005704 | cid_654558
Type:
Small organic molecule
Emp. Form.:
C18H22N4O3S
Mol. Mass.:
374.457
SMILES:
CCCCn1c(SCC(=O)NCc2ccco2)nnc1-c1ccoc1C
: