Target
Perilipin-5
Ligand
BDBM94514
Substrate
IC50
940±n/a nM
Citation
 PubChem, PC Luminescence-based biochemical high throughput dose response assay for inhibitors of the interaction of the lipase co-activator protein, abhydrolase domain containing 5 (ABHD5) with perilipin-5 (MLDP; PLIN5) PubChem Bioassay (2012)[AID] 
Target
Name:
Perilipin-5
Synonyms:
LSDP5 PAT-1 PLIN5_HUMAN
Type:
Enzyme Catalytic Domain
Mol. Mass.:
50774.20
Organism:
Homo sapiens (Human)
Description:
gi_116292172
Residue:
463
  
Inhibitor
Name:
BDBM94514
Synonyms:
MLS003674206 N-cyclohexyl-2-[3-(2-furyl)-2-keto-quinoxalin-1-yl]-2-(1-naphthyl)acetamide N-cyclohexyl-2-[3-(furan-2-yl)-2-oxoquinoxalin-1-yl]-2-naphthalen-1-ylacetamide cid_53383331
Type:
Small organic molecule
Emp. Form.:
C30H27N3O3
Mol. Mass.:
477.5537
SMILES:
O=C(NC1CCCCC1)C(c1cccc2ccccc12)n1c2ccccc2nc(-c2ccco2)c1=O
: