Target
Perilipin-5
Ligand
BDBM87845
Substrate
IC50
941±n/a nM
Citation
 PubChem, PC Luminescence-based biochemical high throughput dose response assay for inhibitors of the interaction of the lipase co-activator protein, abhydrolase domain containing 5 (ABHD5) with perilipin-5 (MLDP; PLIN5) PubChem Bioassay (2012)[AID] 
Target
Name:
Perilipin-5
Synonyms:
LSDP5 PAT-1 PLIN5_HUMAN
Type:
Enzyme Catalytic Domain
Mol. Mass.:
50774.20
Organism:
Homo sapiens (Human)
Description:
gi_116292172
Residue:
463
  
Inhibitor
Name:
BDBM87845
Synonyms:
2-Butyl-thiazolidine-4-carboxylic acid 2-butyl-4-thiazolidinecarboxylic acid MLS000548320 cid_3132640
Type:
Small organic molecule
Emp. Form.:
C8H15NO2S
Mol. Mass.:
189.275
SMILES:
CCCCC1NC(CS1)C(O)=O
: