Target
Low molecular weight phosphotyrosine protein phosphatase
Ligand
BDBM50513
Substrate
IC50
>80000±n/a nM
Citation
 PubChem, PC Dose response confirmation of small molecule inhibitors of Low Molecular Weight Protein Tyrosine Phosphatase, LMPTP, via a fluorescence intensity assay PubChem Bioassay (2012)[AID] 
Target
Name:
Low molecular weight phosphotyrosine protein phosphatase
Synonyms:
3.1.3.2 ACP1 LMW-PTP LMWPTP PPAC_HUMAN low molecular weight phosphotyrosine protein phosphatase isoform c
Type:
Mol. Mass.:
18042.81
Organism:
Homo sapiens (Human)
Description:
P24666
Residue:
158
  
Inhibitor
Name:
BDBM50513
Synonyms:
4-(2,6-bis(3,4-dimethylphenyl)-1,3,5,7-tetraoxo-1,2,3,5,6,7-hexahydropyrrolo[3,4-f]isoindole-4-carbonyl)benzoic acid 4-[2,6-bis(3,4-dimethylphenyl)-1,3,5,7-tetrakis(oxidanylidene)pyrrolo[3,4-f]isoindol-8-yl]carbonylbenzoic acid 4-[[2,6-bis(3,4-dimethylphenyl)-1,3,5,7-tetraoxo-8-pyrrolo[3,4-f]isoindolyl]-oxomethyl]benzoic acid MLS000714384 cid_3108985
Type:
Small organic molecule
Emp. Form.:
C34H24N2O7
Mol. Mass.:
572.5636
SMILES:
Cc1ccc(cc1C)-n1c(=O)c2cc3c(c(C(=O)c4ccc(cc4)C(O)=O)c2c1=O)c(=O)n(-c1ccc(C)c(C)c1)c3=O
: