Target
Huntingtin
Ligand
BDBM96412
Substrate
IC50
1551±n/a nM
Citation
 PubChem, PC Fluorescence-based biochemical high throughput dose response assay to identify molecules that bind r(CAG) RNA repeats PubChem Bioassay (2013)[AID] 
Target
Name:
Huntingtin
Synonyms:
HD HD_HUMAN Homo sapiens huntingtin (HTT), mRNA Huntington disease protein | IT15
Type:
PROTEIN
Mol. Mass.:
347579.69
Organism:
Homo sapiens (Human)
Description:
EBI_101216
Residue:
3142
  
Inhibitor
Name:
BDBM96412
Synonyms:
2-[(2,5-dimethylphenyl)sulfonylamino]-N-(5-methyl-1,2-oxazol-3-yl)benzamide 2-[(2,5-dimethylphenyl)sulfonylamino]-N-(5-methylisoxazol-3-yl)benzamide SMR000065952 | cid_2354951
Type:
Small organic molecule
Emp. Form.:
C19H19N3O4S
Mol. Mass.:
385.437
SMILES:
Cc1cc(NC(=O)c2ccccc2NS(=O)(=O)c2cc(C)ccc2C)no1
: