Target
Huntingtin
Ligand
BDBM55025
Substrate
IC50
2037±n/a nM
Citation
 PubChem, PC Fluorescence-based biochemical high throughput dose response assay to identify molecules that bind r(CAG) RNA repeats PubChem Bioassay (2013)[AID] 
Target
Name:
Huntingtin
Synonyms:
HD HD_HUMAN Homo sapiens huntingtin (HTT), mRNA Huntington disease protein | IT15
Type:
PROTEIN
Mol. Mass.:
347579.69
Organism:
Homo sapiens (Human)
Description:
EBI_101216
Residue:
3142
  
Inhibitor
Name:
BDBM55025
Synonyms:
Benzoic acid N'-[1-(2-cyclohex-1-enyl-ethyl)-4,6-dioxo-2-thioxo-tetrahydro-pyrimidin-(5E)-ylidenemethyl]-hydrazide N'-[(E)-[1-[2-(1-cyclohexenyl)ethyl]-4,6-dioxo-2-sulfanylidene-1,3-diazinan-5-ylidene]methyl]benzohydrazide N'-[(E)-[1-[2-(cyclohexen-1-yl)ethyl]-4,6-diketo-2-thioxo-hexahydropyrimidin-5-ylidene]methyl]benzohydrazide SMR000220836 | cid_5517062
Type:
Small organic molecule
Emp. Form.:
C20H22N4O3S
Mol. Mass.:
398.479
SMILES:
O=C(NNC=C1C(=O)NC(=S)N(CCC2=CCCCC2)C1=O)c1ccccc1
: