Target
Huntingtin
Ligand
BDBM66209
Substrate
IC50
1192±n/a nM
Citation
 PubChem, PC Fluorescence-based biochemical high throughput dose response assay to identify molecules that bind r(CAG) RNA repeats PubChem Bioassay (2013)[AID] 
Target
Name:
Huntingtin
Synonyms:
HD HD_HUMAN Homo sapiens huntingtin (HTT), mRNA Huntington disease protein | IT15
Type:
PROTEIN
Mol. Mass.:
347579.69
Organism:
Homo sapiens (Human)
Description:
EBI_101216
Residue:
3142
  
Inhibitor
Name:
BDBM66209
Synonyms:
3-(1-benzofuran-2-carbonyl)-2-(3-chlorophenyl)-4-hydroxy-1-(5-methyl-1,2-oxazol-3-yl)-2H-pyrrol-5-one 3-[2-benzofuranyl(oxo)methyl]-2-(3-chlorophenyl)-4-hydroxy-1-(5-methyl-3-isoxazolyl)-2H-pyrrol-5-one MLS001147778 cid_3694202
Type:
Small organic molecule
Emp. Form.:
C23H15ClN2O5
Mol. Mass.:
434.829
SMILES:
Cc1cc(no1)N1C(C(C(=O)c2cc3ccccc3o2)C(=O)C1=O)c1cccc(Cl)c1
: