Target
Probable global transcription activator SNF2L2
Ligand
BDBM7238
Substrate
EC50
91161±n/a nM
Citation
 PubChem, PC Luminescence-based cell-based high throughput dose response assay to identify activators of the function of SWI/SNF related, matrix associated, actin dependent regulator of chromatin, subfamily a, member 2 (SMARCA2, BRM) PubChem Bioassay (2013)[AID] 
Target
Name:
Probable global transcription activator SNF2L2
Synonyms:
ATP-dependent helicase SMARCA2 BRG1-associated factor 190B Protein brahma homolog SMCA2_HUMAN SNF2A SWI/SNF-related matrix-associated actin-dependent regulator of chromatin subfamily A member 2 | hBRM
Type:
Enzyme Catalytic Domain
Mol. Mass.:
181290.91
Organism:
Homo sapiens (Human)
Description:
P51531
Residue:
1590
  
Inhibitor
Name:
BDBM7238
Synonyms:
(3Z)-3-(1H-imidazol-5-ylmethylidene)-5-methoxy-2,3-dihydro-1H-indol-2-one SU9516 imidazole indolinone driv.
Type:
Small organic molecule
Emp. Form.:
C13H11N3O2
Mol. Mass.:
241.2453
SMILES:
COc1ccc2NC(=O)C(=Cc3cnc[nH]3)c2c1
: