Target
Galanin receptor type 3
Ligand
BDBM25771
Substrate
IC50
>29916±n/a nM
Citation
 PubChem, PC Fluorescence-based cell-based primary high throughput dose response assay to identify antagonists of the Galanin Receptor 3 (GalR3). PubChem Bioassay (2013)[AID] 
Target
Name:
Galanin receptor type 3
Synonyms:
GALNR3 GALR3_HUMAN Galanin receptor 3 | Galanin receptor type 3
Type:
Enzyme Catalytic Domain
Mol. Mass.:
39599.97
Organism:
Homo sapiens (Human)
Description:
Galanin R3 GALR3 HUMAN::O60755
Residue:
368
  
Inhibitor
Name:
BDBM25771
Synonyms:
1-hydroxy-2-naphthoic acid;4-[1-hydroxy-2-[6-(4-phenylbutoxy)hexylamino]ethyl]-2-methylol-phenol Aeromax Serevent | salmeterol xinafoate
Type:
Small organic molecule
Emp. Form.:
C25H37NO4
Mol. Mass.:
415.5656
SMILES:
OCc1cc(ccc1O)C(O)CNCCCCCCOCCCCc1ccccc1
: