Target
Nociceptin receptor
Ligand
BDBM97711
Substrate
Meas. Tech.
ORL-1 Receptor Binding Assay
pH
7.4±n/a
Temperature
298.15±n/a K
Ki
5.7±0.4 nM
Comments
extracted
Citation
 Tsuno, NYao, J Substituted-quinoxaline-type bridged-piperidine compounds as ORL-1 modulators US Patent  US8476271 Publication Date 7/2/2013 
Target
Name:
Nociceptin receptor
Synonyms:
KOR-3 Mu-type opioid receptor (Mu) Nociceptin Receptor (ORL1 Receptor) Nociceptin receptor (ORL-1) Nociceptin/Orphanin FQ, NOP receptor OPIATE ORL-1 OPRL1 protein ORL1 Opioid receptor like-1 Orphanin FQ receptor (ORL1) | P41146
Type:
G Protein-Coupled Receptor (GPCR)
Mol. Mass.:
40702.87
Organism:
Homo sapiens (Human)
Description:
P41146
Residue:
370
  
Inhibitor
Name:
BDBM97711
Synonyms:
US8476271, 17 US8846929, 361 | US9145408, 361
Type:
Small organic molecule
Emp. Form.:
C25H31N3O3
Mol. Mass.:
421.5319
SMILES:
OC(=O)c1nc2ccccc2n([C@@H]2C[C@@H]3CC[C@H](C2)N3C2CC3CCCC(C3)C2)c1=O
: