Target
Nociceptin receptor
Ligand
BDBM97714
Substrate
Meas. Tech.
ORL-1 Receptor Binding Assay
pH
7.4±n/a
Temperature
298.15±n/a K
Ki
1.1±0.1 nM
Comments
extracted
Citation
 Tsuno, NYao, J Substituted-quinoxaline-type bridged-piperidine compounds as ORL-1 modulators US Patent  US8476271 Publication Date 7/2/2013 
Target
Name:
Nociceptin receptor
Synonyms:
KOR-3 Mu-type opioid receptor (Mu) Nociceptin Receptor (ORL1 Receptor) Nociceptin receptor (ORL-1) Nociceptin/Orphanin FQ, NOP receptor OPIATE ORL-1 OPRL1 protein ORL1 Opioid receptor like-1 Orphanin FQ receptor (ORL1) | P41146
Type:
G Protein-Coupled Receptor (GPCR)
Mol. Mass.:
40702.87
Organism:
Homo sapiens (Human)
Description:
P41146
Residue:
370
  
Inhibitor
Name:
BDBM97714
Synonyms:
US8476271, 405
Type:
Small organic molecule
Emp. Form.:
C27H35N3O3
Mol. Mass.:
449.5851
SMILES:
C[C@H]1C[C@H]2C[C@@H](C1)C[C@@H](C2)N1[C@H]2CCC[C@@H]1C[C@@H](C2)n1c2ccccc2nc(C(O)=O)c1=O
: