Target
Beta-lactamase
Ligand
BDBM98758
Substrate
BDBM98856
Meas. Tech.
Spectrophotometric Assay
IC50
15±0.0 nM
Citation
 Blizzard, TAChen, HGude, CHermes, JDImbriglio, JKim, SWu, JYMortko, CJMangion, IRivera, NRuck, RTShevlin, M Beta-lactamase inhibitors US Patent  US8487093 Publication Date 7/16/2013 
Target
Name:
Beta-lactamase
Synonyms:
Beta-lactamase (AmpC)
Type:
Enzyme
Mol. Mass.:
43489.98
Organism:
Pseudomonas aeruginosa
Description:
Q3LG62
Residue:
397
  
Inhibitor
Name:
BDBM98758
Synonyms:
US8487093, 122
Type:
Small organic molecule
Emp. Form.:
C13H22N4O7S
Mol. Mass.:
378.401
SMILES:
OS(=O)(=O)ON1[C@H]2CN([C@@H](CC2)C(=O)NC[C@H]2CNCCCO2)C1=O
:
Substrate
Name:
BDBM98856
Synonyms:
US8487093, Substrate
Type:
Small organic molecule
Emp. Form.:
C21H16N4O8S2
Mol. Mass.:
516.504
SMILES:
OC(=O)C1=C(CSC2C(NC(=O)Cc3cccs3)C(=O)N12)\C=C\c1ccc(cc1N(=O)=O)N(=O)=O
: