Target
Adenosine receptor A1
Ligand
BDBM99194
Substrate
Meas. Tech.
Binding Assay
Ki
53.1±0.0 nM
Citation
 Jagtap, P Adenosine compounds and their use thereof US Patent  US8501708 Publication Date 8/6/2013 
Target
Name:
Adenosine receptor A1
Synonyms:
AA1R_RABIT ADENOSINE A1 high ADORA1 | Adenosine receptor A1 (A1)
Type:
Enzyme
Mol. Mass.:
36566.33
Organism:
Oryctolagus cuniculus (Rabbit)
Description:
P34970
Residue:
328
  
Inhibitor
Name:
BDBM99194
Synonyms:
US8501708, 14 | US8501708, 15
Type:
Small organic molecule
Emp. Form.:
C23H29N5O5
Mol. Mass.:
455.5069
SMILES:
OC[C@H]1OC([C@H](O)[C@@H]1O)n1cnc2c(NC3CCCCC3OCc3ccccc3)ncnc12
: