Target
COUP transcription factor 2
Ligand
BDBM100228
Substrate
IC50
7914±n/a nM
Citation
 PubChem, PC Luminescence-based cell-based high throughput dose response assay to identify inhibitors of COUP-TFII (NR2F2) PubChem Bioassay (2013)[AID] 
Target
Name:
COUP transcription factor 2
Synonyms:
ARP1 COUP transcription factor 2 isoform a TFCOUP2
Type:
Enzyme Catalytic Domain
Mol. Mass.:
45583.83
Organism:
Homo sapiens (Human)
Description:
gi_14149746
Residue:
414
  
Inhibitor
Name:
BDBM100228
Synonyms:
4-(cyclopentylamino)-2-(3,5-dimethyl-1-pyrazolyl)-5-pyrimidinecarboxylic acid ethyl ester 4-Cyclopentylamino-2-(3,5-dimethyl-pyrazol-1-yl)-pyrimidine-5-carboxylic acid ethyl ester SMR000436423 ethyl 4-(cyclopentylamino)-2-(3,5-dimethylpyrazol-1-yl)pyrimidine-5-carboxylate
Type:
Small organic molecule
Emp. Form.:
C17H23N5O2
Mol. Mass.:
329.3968
SMILES:
CCOC(=O)c1cnc(nc1NC1CCCC1)-n1nc(C)cc1C
: