Target
Serine/threonine-protein kinase PAK 4
Ligand
BDBM101508
Substrate
Meas. Tech.
Enzymatic Assay
Ki
2.6e+2±n/a nM
EC50
262±0 nM
Citation
 Zhang, JGuo, CBouzida, DDong, LLi, HMarakovits, JTYang, AHong, Y Pyrrolopyrazoles, potent kinase inhibitors US Patent  US8530652 Publication Date 9/10/2013 
Target
Name:
Serine/threonine-protein kinase PAK 4
Synonyms:
KIAA1142 PAK4_HUMAN | p21-Activated kinase 4 (PAK4)
Type:
Protein
Mol. Mass.:
64098.01
Organism:
Homo sapiens (Human)
Description:
O96013
Residue:
591
  
Inhibitor
Name:
BDBM101508
Synonyms:
US8524710, 87 US8530652, 80
Type:
Small organic molecule
Emp. Form.:
C24H25N7OS
Mol. Mass.:
459.567
SMILES:
Cc1cc2c(Nc3[nH]nc4c3CN(C(=O)N[C@@H]3C[C@H]3c3ccccc3)C4(C)C)ncnc2s1
: