Target
Serine/threonine-protein kinase PAK 4
Ligand
BDBM101513
Substrate
Meas. Tech.
Enzymatic Assay
Ki
18±n/a nM
EC50
98±0 nM
Citation
 Zhang, JGuo, CBouzida, DDong, LLi, HMarakovits, JTYang, AHong, Y Pyrrolopyrazoles, potent kinase inhibitors US Patent  US8530652 Publication Date 9/10/2013 
Target
Name:
Serine/threonine-protein kinase PAK 4
Synonyms:
KIAA1142 PAK4_HUMAN | p21-Activated kinase 4 (PAK4)
Type:
Protein
Mol. Mass.:
64098.01
Organism:
Homo sapiens (Human)
Description:
O96013
Residue:
591
  
Inhibitor
Name:
BDBM101513
Synonyms:
US8524699, 18 US8530652, 85
Type:
Small organic molecule
Emp. Form.:
C26H24N8O
Mol. Mass.:
464.5218
SMILES:
CC1(C)N(Cc2c(Nc3nc(nc4ccccc34)C#N)[nH]nc12)C(=O)N[C@@H]1C[C@H]1c1ccccc1
: