Target
Serine/threonine-protein kinase PAK 4
Ligand
BDBM101504
Substrate
Meas. Tech.
Enzymatic Assay
Ki
7.2±n/a nM
EC50
21±0 nM
Citation
 Zhang, JGuo, CBouzida, DDong, LLi, HMarakovits, JTYang, AHong, Y Pyrrolopyrazoles, potent kinase inhibitors US Patent  US8530652 Publication Date 9/10/2013 
Target
Name:
Serine/threonine-protein kinase PAK 4
Synonyms:
KIAA1142 PAK4_HUMAN | p21-Activated kinase 4 (PAK4)
Type:
Protein
Mol. Mass.:
64098.01
Organism:
Homo sapiens (Human)
Description:
O96013
Residue:
591
  
Inhibitor
Name:
BDBM101504
Synonyms:
US8524699, 91 US8530652, 31
Type:
Small organic molecule
Emp. Form.:
C24H25N7OS
Mol. Mass.:
459.567
SMILES:
Cc1nc(Nc2[nH]nc3c2CN(C(=O)N[C@@H]2C[C@H]2c2ccccc2)C3(C)C)c2ccsc2n1
: