Target
Serine/threonine-protein kinase PAK 4
Ligand
BDBM101530
Substrate
Meas. Tech.
Enzymatic Assay
Ki
14±n/a nM
EC50
2.5±0.0 nM
Citation
 Zhang, JGuo, CBouzida, DDong, LLi, HMarakovits, JTYang, AHong, Y Pyrrolopyrazoles, potent kinase inhibitors US Patent  US8530652 Publication Date 9/10/2013 
Target
Name:
Serine/threonine-protein kinase PAK 4
Synonyms:
KIAA1142 PAK4_HUMAN | p21-Activated kinase 4 (PAK4)
Type:
Protein
Mol. Mass.:
64098.01
Organism:
Homo sapiens (Human)
Description:
O96013
Residue:
591
  
Inhibitor
Name:
BDBM101530
Synonyms:
US8530494, 29 US8530652, 57
Type:
Small organic molecule
Emp. Form.:
C24H30N10O
Mol. Mass.:
474.5614
SMILES:
CN(C)C[C@@H](NC(=O)N1Cc2c(Nc3ncnc4n(C)cnc34)[nH]nc2C1(C)C)c1ccccc1
: