Target
Serine/threonine-protein kinase PAK 4
Ligand
BDBM101534
Substrate
Meas. Tech.
Enzymatic Assay
Ki
22±n/a nM
EC50
19±0.0 nM
Citation
 Zhang, JGuo, CBouzida, DDong, LLi, HMarakovits, JTYang, AHong, Y Pyrrolopyrazoles, potent kinase inhibitors US Patent  US8530652 Publication Date 9/10/2013 
Target
Name:
Serine/threonine-protein kinase PAK 4
Synonyms:
KIAA1142 PAK4_HUMAN | p21-Activated kinase 4 (PAK4)
Type:
Protein
Mol. Mass.:
64098.01
Organism:
Homo sapiens (Human)
Description:
O96013
Residue:
591
  
Inhibitor
Name:
BDBM101534
Synonyms:
US8530494, 202 US8530652, 61
Type:
Small organic molecule
Emp. Form.:
C24H28N8OS
Mol. Mass.:
476.597
SMILES:
CN(C)C[C@@H](NC(=O)N1Cc2c(Nc3ncnc4sccc34)[nH]nc2C1(C)C)c1ccccc1
: