Target
Serine/threonine-protein kinase PAK 4
Ligand
BDBM101535
Substrate
Meas. Tech.
Enzymatic Assay
Ki
15±n/a nM
EC50
15±0.0 nM
Citation
 Zhang, JGuo, CBouzida, DDong, LLi, HMarakovits, JTYang, AHong, Y Pyrrolopyrazoles, potent kinase inhibitors US Patent  US8530652 Publication Date 9/10/2013 
Target
Name:
Serine/threonine-protein kinase PAK 4
Synonyms:
KIAA1142 PAK4_HUMAN | p21-Activated kinase 4 (PAK4)
Type:
Protein
Mol. Mass.:
64098.01
Organism:
Homo sapiens (Human)
Description:
O96013
Residue:
591
  
Inhibitor
Name:
BDBM101535
Synonyms:
US8530494, 104 US8530652, 62
Type:
Small organic molecule
Emp. Form.:
C25H30N8OS
Mol. Mass.:
490.624
SMILES:
CN(C)C[C@@H](NC(=O)N1Cc2c(Nc3ncnc4sc(C)cc34)[nH]nc2C1(C)C)c1ccccc1
: