Target
Serine/threonine-protein kinase PAK 4
Ligand
BDBM101540
Substrate
Meas. Tech.
Enzymatic Assay
Ki
2.8e+2±n/a nM
EC50
20±0.0 nM
Citation
 Zhang, JGuo, CBouzida, DDong, LLi, HMarakovits, JTYang, AHong, Y Pyrrolopyrazoles, potent kinase inhibitors US Patent  US8530652 Publication Date 9/10/2013 
Target
Name:
Serine/threonine-protein kinase PAK 4
Synonyms:
KIAA1142 PAK4_HUMAN | p21-Activated kinase 4 (PAK4)
Type:
Protein
Mol. Mass.:
64098.01
Organism:
Homo sapiens (Human)
Description:
O96013
Residue:
591
  
Inhibitor
Name:
BDBM101540
Synonyms:
US8530494, 205 US8530652, 67
Type:
Small organic molecule
Emp. Form.:
C22H27FN8O
Mol. Mass.:
438.5012
SMILES:
CN(C)C[C@@H](NC(=O)N1Cc2c(Nc3ncncc3F)[nH]nc2C1(C)C)c1ccccc1
: